Plasma nano fails to build on Arch Linux ARM (aarch64)

Hi. I’m trying to build plasma-nano from AUR on aarch64 on a fully upgraded Arch Linux ARM but it fails:

[ 33%] Built target plasmananoshellprivateplugin_autogen
[ 44%] Building CXX object components/CMakeFiles/plasmananoshellprivateplugin.dir/plasmananoshellprivateplugin_autogen/mocs_compilation.cpp.o
[ 55%] Building CXX object components/CMakeFiles/plasmananoshellprivateplugin.dir/fullscreenoverlay.cpp.o
[ 66%] Building CXX object components/CMakeFiles/plasmananoshellprivateplugin.dir/nanoshellprivateplugin.cpp.o
[ 77%] Building CXX object components/CMakeFiles/plasmananoshellprivateplugin.dir/startupnotifier.cpp.o
[ 88%] Linking CXX shared library ../bin/
/usr/bin/ld: warning: -z pack-relative-relocs ignored
collect2: error: ld returned 1 exit status
make[2]: *** [components/CMakeFiles/plasmananoshellprivateplugin.dir/build.make:154: bin/] Error 1
make[1]: *** [CMakeFiles/Makefile2:508: components/CMakeFiles/plasmananoshellprivateplugin.dir/all] Error 2
make: *** [Makefile:136: all] Error 2
==> ERROR: A failure occurred in build().

Full log can be found here: :: Starting the build:==> Making package: plasma-nano 6.0.3-0 (Sun Apr 7 14:1 -

I’m using pikaur as AUR helper and the package builds fine on Arch Linux x86_64.

I managed to get it to build on aarch64 after modifying /etc/makepkg.conf as this: # #!/hint/bash# shellcheck disable=2034## /etc/makepkg.conf####### - If you have trouble logging afterwards make sure “qqc2-breeze-style” has been upgraded as well.